Target
Histamine H3 receptor
Ligand
BDBM50327475
Substrate
Meas. Tech.
ChEMBL_664613 (CHEMBL1260327)
Ki
6±n/a nM
Citation
 Richter, HGFreichel, CHuwyler, JNakagawa, TNettekoven, MPlancher, JMRaab, SRoche, OSchuler, FTaylor, SUllmer, CWiegand, R Discovery of potent and selective histamine H3 receptor inverse agonists based on the 3,4-dihydro-2H-pyrazino[1,2-a]indol-1-one scaffold. Bioorg Med Chem Lett 20:5713-7 (2010)  
Target
Name:
Histamine H3 receptor
Synonyms:
G-protein coupled receptor 97 HH3R HRH3 Histamine H3 receptor (H3) Histamine receptor (H3 and H4)
Type:
G Protein-Coupled Receptor (GPCR)
Mol. Mass.:
48691.47
Organism:
Homo sapiens (Human)
Description:
Binding assays were using CHO cells stably expressing hH3R receptors.
Residue:
445
  
Inhibitor
Name:
BDBM50327475
Synonyms:
(S)-8-(1-isopropylpiperidin-4-yloxy)-3-methyl-3,4-dihydropyrazino[1,2-a]indol-1(2H)-one | CHEMBL1257850
Type:
Small organic molecule
Emp. Form.:
C20H27N3O2
Mol. Mass.:
341.4473
SMILES:
CC(C)N1CCC(CC1)Oc1ccc2n3C[C@H](C)NC(=O)c3cc2c1
: