Target
Muscarinic acetylcholine receptor M5
Ligand
BDBM50327637
Substrate
Meas. Tech.
ChEMBL_664981 (CHEMBL1259938)
EC50
1600±n/a nM
Citation
 Bridges, TMKennedy, JPHopkins, CRConn, PJLindsley, CW Heterobiaryl and heterobiaryl ether derived M5 positive allosteric modulators. Bioorg Med Chem Lett 20:5617-22 (2010)  
Target
Name:
Muscarinic acetylcholine receptor M5
Synonyms:
ACM5_HUMAN | CHRM5
Type:
PROTEIN
Mol. Mass.:
60102.35
Organism:
Homo sapiens (Human)
Description:
ChEMBL_1517990
Residue:
532
  
Inhibitor
Name:
BDBM50327637
Synonyms:
1-(4-(pyridin-3-yl)benzyl)-5-(trifluoromethoxy)indoline-2,3-dione | CHEMBL1257388
Type:
Small organic molecule
Emp. Form.:
C21H13F3N2O3
Mol. Mass.:
398.3347
SMILES:
FC(F)(F)Oc1ccc2N(Cc3ccc(cc3)-c3cccnc3)C(=O)C(=O)c2c1
: