Target
Fatty acid synthase
Ligand
BDBM50155447
Substrate
Meas. Tech.
ChEMBL_665032 (CHEMBL1260142)
IC50
17850±n/a nM
Citation
 Jiang, HZQuan, XFTian, WXHu, JMWang, PCHuang, SZCheng, ZQLiang, WJZhou, JMa, XFZhao, YX Fatty acid synthase inhibitors of phenolic constituents isolated from Garcinia mangostana. Bioorg Med Chem Lett 20:6045-7 (2010)  
Target
Name:
Fatty acid synthase
Synonyms:
FAS FAS_HUMAN HU FASN
Type:
Enzyme
Mol. Mass.:
273419.37
Organism:
Homo sapiens (Human)
Description:
P49327
Residue:
2511
  
Inhibitor
Name:
BDBM50155447
Synonyms:
1,3,6,7-Tetrahydroxy-xanthen-9-one CHEMBL187265
Type:
Small organic molecule
Emp. Form.:
C13H8O6
Mol. Mass.:
260.199
SMILES:
Oc1cc(O)c2c(c1)oc1cc(O)c(O)cc1c2=O
: