Target
Mast/stem cell growth factor receptor Kit
Ligand
BDBM50327912
Substrate
Meas. Tech.
ChEMBL_665051 (CHEMBL1260161)
IC50
35±n/a nM
Citation
 Bindi, SFancelli, DAlli, CBerta, DBertrand, JACameron, ADCappella, PCarpinelli, PCervi, GCroci, VD'Anello, MForte, BGiorgini, MLMarsiglio, AMoll, JPesenti, EPittalà, VPulici, MRiccardi-Sirtori, FRoletto, FSoncini, CStorici, PVarasi, MVolpi, DZugnoni, PVianello, P Thieno[3,2-c]pyrazoles: a novel class of Aurora inhibitors with favorable antitumor activity. Bioorg Med Chem 18:7113-20 (2010)  
Target
Name:
Mast/stem cell growth factor receptor Kit
Synonyms:
CD117 antigen KIT Mast/stem cell growth factor receptor Kit (cKIT) Proto-oncogene tyrosine-protein kinase Kit Stem cell growth factor receptor Tyrosine-protein kinase Kit c-kit v-kit Hardy-Zuckerman 4 feline sarcoma viral oncogene homolog
Type:
Protein
Mol. Mass.:
109869.37
Organism:
Homo sapiens (Human)
Description:
P10721
Residue:
976
  
Inhibitor
Name:
BDBM50327912
Synonyms:
3-(4-Morpholin-4-yl-benzoylamino)-1H-thieno[3,2-c]pyrazole-5-carboxylic acid((S)-1-phenyl-2-pyrrolidin-1-yl-ethyl)-amide | CHEMBL1258913
Type:
Small organic molecule
Emp. Form.:
C29H32N6O3S
Mol. Mass.:
544.668
SMILES:
O=C(N[C@H](CN1CCCC1)c1ccccc1)c1cc2n[nH]c(NC(=O)c3ccc(cc3)N3CCOCC3)c2s1
: