Target
Aurora kinase C
Ligand
BDBM50327912
Substrate
Meas. Tech.
ChEMBL_665048 (CHEMBL1260158)
IC50
62±n/a nM
Citation
 Bindi, SFancelli, DAlli, CBerta, DBertrand, JACameron, ADCappella, PCarpinelli, PCervi, GCroci, VD'Anello, MForte, BGiorgini, MLMarsiglio, AMoll, JPesenti, EPittalà, VPulici, MRiccardi-Sirtori, FRoletto, FSoncini, CStorici, PVarasi, MVolpi, DZugnoni, PVianello, P Thieno[3,2-c]pyrazoles: a novel class of Aurora inhibitors with favorable antitumor activity. Bioorg Med Chem 18:7113-20 (2010)  
Target
Name:
Aurora kinase C
Synonyms:
AIE2 AIRK3 AURKC Aurora Kinase C (Aurora-C) Aurora kinase C (AURKC) Aurora-C/INCENP Aurora/Ipl1/Eg2 protein 2 Serine/threonine-protein kinase 13 | Serine/threonine-protein kinase Aurora-C
Type:
Enzyme
Mol. Mass.:
35602.43
Organism:
Homo sapiens (Human)
Description:
Amino acid residues 1-309 were expressed as His-tagged fusion protein using baculovirus expression system.
Residue:
309
  
Inhibitor
Name:
BDBM50327912
Synonyms:
3-(4-Morpholin-4-yl-benzoylamino)-1H-thieno[3,2-c]pyrazole-5-carboxylic acid((S)-1-phenyl-2-pyrrolidin-1-yl-ethyl)-amide | CHEMBL1258913
Type:
Small organic molecule
Emp. Form.:
C29H32N6O3S
Mol. Mass.:
544.668
SMILES:
O=C(N[C@H](CN1CCCC1)c1ccccc1)c1cc2n[nH]c(NC(=O)c3ccc(cc3)N3CCOCC3)c2s1
: