Target
MAP kinase-activated protein kinase 2
Ligand
BDBM50327912
Substrate
Meas. Tech.
ChEMBL_665079 (CHEMBL1260189)
IC50
>10000±n/a nM
Citation
 Bindi, SFancelli, DAlli, CBerta, DBertrand, JACameron, ADCappella, PCarpinelli, PCervi, GCroci, VD'Anello, MForte, BGiorgini, MLMarsiglio, AMoll, JPesenti, EPittalà, VPulici, MRiccardi-Sirtori, FRoletto, FSoncini, CStorici, PVarasi, MVolpi, DZugnoni, PVianello, P Thieno[3,2-c]pyrazoles: a novel class of Aurora inhibitors with favorable antitumor activity. Bioorg Med Chem 18:7113-20 (2010)  
Target
Name:
MAP kinase-activated protein kinase 2
Synonyms:
MAP kinase-activated protein kinase 2 (MAPKAPK2) MAP kinase-activated protein kinase 2 (p38/MK2) MAPK-activated protein kinase 2 MAPKAP kinase 2 MAPKAPK2 | MK2
Type:
Serine/threonine-protein kinase
Mol. Mass.:
45579.87
Organism:
Homo sapiens (Human)
Description:
P49137
Residue:
400
  
Inhibitor
Name:
BDBM50327912
Synonyms:
3-(4-Morpholin-4-yl-benzoylamino)-1H-thieno[3,2-c]pyrazole-5-carboxylic acid((S)-1-phenyl-2-pyrrolidin-1-yl-ethyl)-amide | CHEMBL1258913
Type:
Small organic molecule
Emp. Form.:
C29H32N6O3S
Mol. Mass.:
544.668
SMILES:
O=C(N[C@H](CN1CCCC1)c1ccccc1)c1cc2n[nH]c(NC(=O)c3ccc(cc3)N3CCOCC3)c2s1
: