Target
cAMP-specific 3',5'-cyclic phosphodiesterase 4B
Ligand
BDBM14361
Substrate
Meas. Tech.
ChEMBL_665324 (CHEMBL1261001)
IC50
498±n/a nM
Citation
 Taltavull, JSerrat, JGràcia, JGavaldà, AAndrés, MCórdoba, MMiralpeix, MVilella, DBeleta, JRyder, HPagès, L Synthesis and biological activity of pyrido[3',2':4,5]thieno[3,2-d]pyrimidines as phosphodiesterase type 4 inhibitors. J Med Chem 53:6912-22 (2010)  
Target
Name:
cAMP-specific 3',5'-cyclic phosphodiesterase 4B
Synonyms:
3',5'-cyclic phosphodiesterase Isoform PDE4B1 PDE4B PDE4B_HUMAN Phosphodiesterase 4B (PDE4B) Phosphodiesterase Type 4 (PDE4B)
Type:
Protein
Mol. Mass.:
83318.87
Organism:
Homo sapiens (Human)
Description:
Q07343
Residue:
736
  
Inhibitor
Name:
BDBM14361
Synonyms:
(R,S)-Rolipram 4-[3-(cyclopentyloxy)-4-methoxyphenyl]pyrrolidin-2-one CHEMBL63 | Rolipram
Type:
Small organic molecule
Emp. Form.:
C16H21NO3
Mol. Mass.:
275.3428
SMILES:
COc1ccc(cc1OC1CCCC1)C1CNC(=O)C1
: