Target
Beta-2 adrenergic receptor
Ligand
BDBM50328294
Substrate
Meas. Tech.
ChEMBL_665492 (CHEMBL1261323)
Ki
4±n/a nM
Citation
 Tasler, SBaumgartner, RAmmendola, ASchachtner, JWieber, TBlisse, MRath, SZaja, MKlahn, PQuotschalla, UNey, P Thienopyrimidines asß3-adrenoceptor agonists: hit-to-lead optimization. Bioorg Med Chem Lett 20:6108-15 (2010)  
Target
Name:
Beta-2 adrenergic receptor
Synonyms:
ADRB2 ADRB2_HUMAN Beta-2 adrenoceptor | Beta-2 adrenoreceptor
Type:
Mol. Mass.:
46461.69
Organism:
Homo sapiens (Human)
Description:
P07550
Residue:
413
  
Inhibitor
Name:
BDBM50328294
Synonyms:
1-phenoxy-3-(1-(5-(thiophen-2-yl)thieno[2,3-d]pyrimidin-4-yl)piperidin-4-ylamino)propan-2-ol | CHEMBL1258025
Type:
Small organic molecule
Emp. Form.:
C24H26N4O2S2
Mol. Mass.:
466.619
SMILES:
OC(CNC1CCN(CC1)c1ncnc2scc(-c3cccs3)c12)COc1ccccc1
: