Target
Beta-3 adrenergic receptor
Ligand
BDBM50328320
Substrate
Meas. Tech.
ChEMBL_665493 (CHEMBL1261324)
Ki
770±n/a nM
Citation
 Tasler, SBaumgartner, RAmmendola, ASchachtner, JWieber, TBlisse, MRath, SZaja, MKlahn, PQuotschalla, UNey, P Thienopyrimidines asß3-adrenoceptor agonists: hit-to-lead optimization. Bioorg Med Chem Lett 20:6108-15 (2010)  
Target
Name:
Beta-3 adrenergic receptor
Synonyms:
ADRB3 ADRB3_HUMAN Beta-2 adrenergic receptor and beta-3 adrenergic receptor Beta-3 adrenoreceptor | adrenergic Beta3
Type:
G Protein-Coupled Receptor (GPCR)
Mol. Mass.:
43534.88
Organism:
Homo sapiens (Human)
Description:
Residue:
408
  
Inhibitor
Name:
BDBM50328320
Synonyms:
1-(4-((5-(4-fluorophenyl)thieno[2,3-d]pyrimidin-4-ylamino)methyl)piperidin-1-yl)-3-phenoxypropan-2-ol | CHEMBL1257326
Type:
Small organic molecule
Emp. Form.:
C27H29FN4O2S
Mol. Mass.:
492.608
SMILES:
OC(COc1ccccc1)CN1CCC(CNc2ncnc3scc(-c4ccc(F)cc4)c23)CC1
: