Target
Alpha-1B adrenergic receptor
Ligand
BDBM50328479
Substrate
Meas. Tech.
ChEMBL_665657 (CHEMBL1261588)
Ki
0.36±n/a nM
Citation
 Kristensen, JLPüschl, AJensen, MRisgaard, RChristoffersen, CTBang-Andersen, BBalle, T Exploring the neuroleptic substituent in octoclothepin: potential ligands for positron emission tomography with subnanomolar affinity fora(1)-adrenoceptors. J Med Chem 53:7021-34 (2010)  
Target
Name:
Alpha-1B adrenergic receptor
Synonyms:
ADA1B_MESAU Adrenergic receptor alpha adrenergic Alpha1B
Type:
Enzyme Catalytic Domain
Mol. Mass.:
56514.13
Organism:
C.H.O.
Description:
adrenergic Alpha1B ADRA1B C.H.O.::P18841
Residue:
515
  
Inhibitor
Name:
BDBM50328479
Synonyms:
1-Methyl-4-(8-(1-methyl-1H-tetrazol-5-yl)-10,11-dihydrodibenzo[b,f]thiepin-10-yl)piperazine | CHEMBL1259217
Type:
Small organic molecule
Emp. Form.:
C21H24N6S
Mol. Mass.:
392.52
SMILES:
CN1CCN(CC1)C1Cc2ccccc2Sc2ccc(cc12)-c1nnnn1C
: