Target
Heat shock protein HSP 90-beta
Ligand
BDBM20926
Substrate
Meas. Tech.
ChEMBL_675338 (CHEMBL1273375)
IC50
31±n/a nM
Citation
 Massey, AJ ATPases as drug targets: insights from heat shock proteins 70 and 90. J Med Chem 53:7280-6 (2010)  
Target
Name:
Heat shock protein HSP 90-beta
Synonyms:
HS90B_HUMAN HSP 90 HSP90B HSPCB Heat shock protein HSP 90 (Hsp90)
Type:
Molecular Chaperone
Mol. Mass.:
83229.45
Organism:
Homo sapiens (Human)
Description:
P08238
Residue:
724
  
Inhibitor
Name:
BDBM20926
Synonyms:
5-[2,4-dihydroxy-5-(propan-2-yl)phenyl]-N-ethyl-4-[4-(morpholin-4-ylmethyl)phenyl]-1,2-oxazole-3-carboxamide VER-52296/NVP-AUY922
Type:
Small organic molecule
Emp. Form.:
C26H31N3O5
Mol. Mass.:
465.5414
SMILES:
CCNC(=O)c1noc(c1-c1ccc(CN2CCOCC2)cc1)-c1cc(C(C)C)c(O)cc1O
: