Target
Heat shock cognate 71 kDa protein
Ligand
BDBM32378
Substrate
Meas. Tech.
ChEMBL_675339 (CHEMBL1273376)
IC50
10400±n/a nM
Citation
 Massey, AJ ATPases as drug targets: insights from heat shock proteins 70 and 90. J Med Chem 53:7280-6 (2010)  
Target
Name:
Heat shock cognate 71 kDa protein
Synonyms:
HSC70 HSP7C_HUMAN HSPA8 heat shock 70kDa protein 8 isoform 2
Type:
Enzyme Catalytic Domain
Mol. Mass.:
70887.67
Organism:
Homo sapiens (Human)
Description:
gi_5729877
Residue:
646
  
Inhibitor
Name:
BDBM32378
Synonyms:
adenosine-derived inhibitor (Grp78), 13 | adenosine-derived inhibitor, 12
Type:
Small organic molecule
Emp. Form.:
C25H23Cl2N7O4
Mol. Mass.:
556.401
SMILES:
Nc1ncnc2n([C@@H]3O[C@H](COCc4ccc(cc4)C#N)[C@@H](O)[C@H]3O)c(NCc3ccc(Cl)c(Cl)c3)nc12
: