Target
Nitric oxide synthase, brain
Ligand
BDBM50328817
Substrate
Meas. Tech.
ChEMBL_673782 (CHEMBL1274959)
Ki
110±n/a nM
Citation
 Xue, FLi, HFang, JRoman, LJMartásek, PPoulos, TLSilverman, RB Peripheral but crucial: a hydrophobic pocket (Tyr(706), Leu(337), and Met(336)) for potent and selective inhibition of neuronal nitric oxide synthase. Bioorg Med Chem Lett 20:6258-61 (2010)  
Target
Name:
Nitric oxide synthase, brain
Synonyms:
Bnos NC-NOS NOS type I nNOS Neuronal nitric oxide synthase Nitric Oxide Synthase, brain Nitric oxide synthase, brain (nNOS) Nitric-oxide synthase, brain (nNOS) Nos1 | Peptidyl-cysteine S-nitrosylase NOS1
Type:
Enzyme
Mol. Mass.:
160570.98
Organism:
Rattus norvegicus (rat)
Description:
Recombinant nNOS overexpressed in E. coli was used in enzyme assays.
Residue:
1429
  
Inhibitor
Name:
BDBM50328817
Synonyms:
CHEMBL1270460 | N-(3-Fluorophenethyl)-2-((3R,4R)-4-((6-iminopiperidin-2-yl)methyl)pyrrolidin-3-yloxy)ethanamine
Type:
Small organic molecule
Emp. Form.:
C20H31FN4O
Mol. Mass.:
362.4847
SMILES:
NC1=NC(C[C@@H]2CNC[C@@H]2OCCNCCc2cccc(F)c2)CCC1
: