Target
PH domain leucine-rich repeat-containing protein phosphatase 2
Ligand
BDBM54340
Substrate
Meas. Tech.
ChEMBL_673824 (CHEMBL1275001)
IC50
10000±n/a nM
Citation
 Sierecki, ESinko, WMcCammon, JANewton, AC Discovery of small molecule inhibitors of the PH domain leucine-rich repeat protein phosphatase (PHLPP) by chemical and virtual screening. J Med Chem 53:6899-911 (2010)  
Target
Name:
PH domain leucine-rich repeat-containing protein phosphatase 2
Synonyms:
KIAA0931 PHLP2_HUMAN PHLPP2 | PHLPPL
Type:
PROTEIN
Mol. Mass.:
146727.83
Organism:
Homo sapiens (Human)
Description:
ChEMBL_673824
Residue:
1323
  
Inhibitor
Name:
BDBM54340
Synonyms:
4-[4-(3-chlorophenyl)-1-piperazinyl]-3-methylisoxazolo[5,4-d]pyrimidine 4-[4-(3-chlorophenyl)piperazino]-3-methyl-isoxazolo[5,4-d]pyrimidine MLS000706926 cid_1481225
Type:
Small organic molecule
Emp. Form.:
C16H16ClN5O
Mol. Mass.:
329.784
SMILES:
Cc1noc2ncnc(N3CCN(CC3)c3cccc(Cl)c3)c12
: