Target
Cannabinoid receptor 2
Ligand
BDBM50329141
Substrate
Meas. Tech.
ChEMBL_674397 (CHEMBL1274726)
Ki
4.2±n/a nM
Citation
 Tong, LShankar, BBChen, LRizvi, RKelly, JGilbert, EHuang, CYang, DYKozlowski, JAShih, NYGonsiorek, WHipkin, RWMalikzay, ALunn, CALundell, DJ Expansion of SAR studies on triaryl bis sulfone cannabinoid CB2 receptor ligands. Bioorg Med Chem Lett 20:6785-9 (2010)  
Target
Name:
Cannabinoid receptor 2
Synonyms:
CANNABINOID CB2 CB2 CB2B CNR2_HUMAN Cannabinoid CB2 receptor Cannabinoid receptor 2 (CB2R) | hCB2
Type:
G Protein-Coupled Receptor (GPCR)
Mol. Mass.:
39690.94
Organism:
Homo sapiens (Human)
Description:
P34972
Residue:
360
  
Inhibitor
Name:
BDBM50329141
Synonyms:
1,1,1-trifluoro-N-((1-(1-(2-fluorophenylsulfonyl)-1H-indol-2-ylsulfonyl)-3,3-dimethylpiperidin-4-yl)methyl)methanesulfonamide | CHEMBL1270193
Type:
Small organic molecule
Emp. Form.:
C23H25F4N3O6S3
Mol. Mass.:
611.65
SMILES:
CC1(C)CN(CCC1CNS(=O)(=O)C(F)(F)F)S(=O)(=O)c1cc2ccccc2n1S(=O)(=O)c1ccccc1F
: