Target
C-C motif chemokine 5
Ligand
BDBM50329251
Substrate
Meas. Tech.
ChEMBL_675123 (CHEMBL1272914)
IC50
34±n/a nM
Citation
 Wanner, JChen, LLemoine, RCKondru, RJekle, AHeilek, GdeRosier, AJi, CBerry, PWRotstein, DM Evaluation of amide replacements in CCR5 antagonists as a means to increase intrinsic permeability. Part 2: SAR optimization and pharmacokinetic profile of a homologous azacyle series. Bioorg Med Chem Lett 20:6802-7 (2010)  
Target
Name:
C-C motif chemokine 5
Synonyms:
CCL5 D17S136E Eosinophil chemotactic cytokine RANTES(4-68) SIS-delta T cell-specific protein P228 TCP228
Type:
PROTEIN
Mol. Mass.:
9996.11
Organism:
Homo sapiens (Human)
Description:
ChEMBL_1363187
Residue:
91
  
Inhibitor
Name:
BDBM50329251
Synonyms:
(4,6-dimethyl pyrimidin-5-yl)((3aR,6aS)-5-(3-(1-(methylsulfonyl)piperidin-4-yl)-3-phenylpropyl)hexahydropyrrolo[3,4-c]pyrrol-2(1H)-yl)methanone CHEMBL1270901
Type:
Small organic molecule
Emp. Form.:
C28H39N5O3S
Mol. Mass.:
525.706
SMILES:
Cc1ncnc(C)c1C(=O)N1C[C@@H]2CN(CCC(C3CCN(CC3)S(C)(=O)=O)c3ccccc3)C[C@@H]2C1
: