Target
Polyunsaturated fatty acid lipoxygenase ALOX15
Ligand
BDBM50417158
Substrate
Meas. Tech.
ChEMBL_675422 (CHEMBL1273502)
Ki
1000±n/a nM
Citation
 Rai, GKenyon, VJadhav, ASchultz, LArmstrong, MJameson, JBHoobler, ELeister, WSimeonov, AHolman, TRMaloney, DJ Discovery of potent and selective inhibitors of human reticulocyte 15-lipoxygenase-1. J Med Chem 53:7392-404 (2010)  
Target
Name:
Polyunsaturated fatty acid lipoxygenase ALOX15
Synonyms:
15-Lipoxygenase-1 (15-LOX-1) Arachidonate 15-lipoxygenase LOG15 Reticulocyte 15-lipoxygenase-1 | Sphingosine 1-phosphate receptor 1 (S1P1)
Type:
Protein
Mol. Mass.:
74804.05
Organism:
Homo sapiens (Human)
Description:
Residue:
662
  
Inhibitor
Name:
BDBM50417158
Synonyms:
CHEMBL1270706
Type:
Small organic molecule
Emp. Form.:
C17H11FN2O4S
Mol. Mass.:
358.344
SMILES:
Fc1ccc(cc1)C(=O)OCC#CCSc1nnc(o1)-c1ccco1
: