Target
Adenosine receptor A2a
Ligand
BDBM50329345
Substrate
Meas. Tech.
ChEMBL_675428 (CHEMBL1273565)
Ki
25±n/a nM
Citation
 McGuinness, BFCole, AGDong, GBrescia, MRShao, YHenderson, IRokosz, LLStauffer, TMMannava, NKimble, EFHicks, CWhite, NWines, PGQuadros, E Discovery of 2-aminoimidazopyridine adenosine A(2A) receptor antagonists. Bioorg Med Chem Lett 20:6845-9 (2010)  
Target
Name:
Adenosine receptor A2a
Synonyms:
A2A adenosine receptor (hA2A) ADENOSINE A2 ADORA2 Adenosine A2A receptor (A2AAR)
Type:
G Protein-Coupled Receptor (GPCR)
Mol. Mass.:
44716.46
Organism:
Homo sapiens (Human)
Description:
P29274
Residue:
412
  
Inhibitor
Name:
BDBM50329345
Synonyms:
2-(3-cyanobenzamido)-N-ethyl-3-(3-methoxypropyl)-N-methyl-3H-imidazo[4,5-b]pyridine-6-carboxamide | CHEMBL1270610
Type:
Small organic molecule
Emp. Form.:
C22H24N6O3
Mol. Mass.:
420.4644
SMILES:
CCN(C)C(=O)c1cnc2n(CCCOC)c(NC(=O)c3cccc(c3)C#N)nc2c1
: