Target
Adenosine receptor A2a
Ligand
BDBM50329345
Substrate
Meas. Tech.
ChEMBL_675431 (CHEMBL1273568)
Ki
24±n/a nM
Citation
 McGuinness, BFCole, AGDong, GBrescia, MRShao, YHenderson, IRokosz, LLStauffer, TMMannava, NKimble, EFHicks, CWhite, NWines, PGQuadros, E Discovery of 2-aminoimidazopyridine adenosine A(2A) receptor antagonists. Bioorg Med Chem Lett 20:6845-9 (2010)  
Target
Name:
Adenosine receptor A2a
Synonyms:
AA2AR_RAT Adenosine A2 receptor Adenosine Receptors A2a (A2a) Adenosine receptors A2a Rat striatal adenosine A2a receptor
Type:
G Protein-Coupled Receptor (GPCR)
Mol. Mass.:
45015.65
Organism:
Rattus norvegicus (rat)
Description:
Rat A2A receptors expressed in CHO cells.
Residue:
410
  
Inhibitor
Name:
BDBM50329345
Synonyms:
2-(3-cyanobenzamido)-N-ethyl-3-(3-methoxypropyl)-N-methyl-3H-imidazo[4,5-b]pyridine-6-carboxamide | CHEMBL1270610
Type:
Small organic molecule
Emp. Form.:
C22H24N6O3
Mol. Mass.:
420.4644
SMILES:
CCN(C)C(=O)c1cnc2n(CCCOC)c(NC(=O)c3cccc(c3)C#N)nc2c1
: