Target
Carbonic anhydrase 1
Ligand
BDBM50329766
Substrate
Meas. Tech.
ChEMBL_674740 (CHEMBL1273993)
Kd
70±n/a nM
Citation
 Sudžius, JBaranauskiene, LGolovenko, DMatuliene, JMichailoviene, VTorresan, JJachno, JSukackaite, RManakova, EGražulis, STumkevičius, SMatulis, D 4-[N-(substituted 4-pyrimidinyl)amino]benzenesulfonamides as inhibitors of carbonic anhydrase isozymes I, II, VII, and XIII. Bioorg Med Chem 18:7413-21 (2010)  
Target
Name:
Carbonic anhydrase 1
Synonyms:
CA-I CAB Carbonate dehydratase I Carbonic anhydrase 1 (CA I) Carbonic anhydrase 1 (Recombinant CA I) Carbonic anhydrase B Carbonic anhydrase I (CA I) Carbonic anhydrase I (CAI) Carbonic anhydrase isoenzyme I (hCA I) | hCA
Type:
Enzyme
Mol. Mass.:
28873.37
Organism:
Homo sapiens (Human)
Description:
P00915
Residue:
261
  
Inhibitor
Name:
BDBM50329766
Synonyms:
4-[N-(6-Benzylamino-5-nitro-4-yl)amino]benzenesulfonamide | CHEMBL1271521
Type:
Small organic molecule
Emp. Form.:
C17H16N6O4S
Mol. Mass.:
400.412
SMILES:
NS(=O)(=O)c1ccc(Nc2ncnc(NCc3ccccc3)c2[N+]([O-])=O)cc1
: