Target
Carbonic anhydrase 1
Ligand
BDBM50044311
Substrate
Meas. Tech.
ChEMBL_674740 (CHEMBL1273993)
Kd
50±n/a nM
Citation
 Sudžius, JBaranauskiene, LGolovenko, DMatuliene, JMichailoviene, VTorresan, JJachno, JSukackaite, RManakova, EGražulis, STumkevičius, SMatulis, D 4-[N-(substituted 4-pyrimidinyl)amino]benzenesulfonamides as inhibitors of carbonic anhydrase isozymes I, II, VII, and XIII. Bioorg Med Chem 18:7413-21 (2010)  
Target
Name:
Carbonic anhydrase 1
Synonyms:
CA-I CAB Carbonate dehydratase I Carbonic anhydrase 1 (CA I) Carbonic anhydrase 1 (Recombinant CA I) Carbonic anhydrase B Carbonic anhydrase I (CA I) Carbonic anhydrase I (CAI) Carbonic anhydrase isoenzyme I (hCA I) | hCA
Type:
Enzyme
Mol. Mass.:
28873.37
Organism:
Homo sapiens (Human)
Description:
P00915
Residue:
261
  
Inhibitor
Name:
BDBM50044311
Synonyms:
CHEMBL67511 Trifluoro-methanesulfonamide | trifluoromethanesulfonamide
Type:
Small organic molecule
Emp. Form.:
CH2F3NO2S
Mol. Mass.:
149.092
SMILES:
NS(=O)(=O)C(F)(F)F
: