Target
Carbonic anhydrase 1
Ligand
BDBM50329763
Substrate
Meas. Tech.
ChEMBL_674741 (CHEMBL1273994)
Kd
2800±n/a nM
Citation
 Sudžius, JBaranauskiene, LGolovenko, DMatuliene, JMichailoviene, VTorresan, JJachno, JSukackaite, RManakova, EGražulis, STumkevičius, SMatulis, D 4-[N-(substituted 4-pyrimidinyl)amino]benzenesulfonamides as inhibitors of carbonic anhydrase isozymes I, II, VII, and XIII. Bioorg Med Chem 18:7413-21 (2010)  
Target
Name:
Carbonic anhydrase 1
Synonyms:
CA-I CAB Carbonate dehydratase I Carbonic anhydrase 1 (CA I) Carbonic anhydrase 1 (Recombinant CA I) Carbonic anhydrase B Carbonic anhydrase I (CA I) Carbonic anhydrase I (CAI) Carbonic anhydrase isoenzyme I (hCA I) | hCA
Type:
Enzyme
Mol. Mass.:
28873.37
Organism:
Homo sapiens (Human)
Description:
P00915
Residue:
261
  
Inhibitor
Name:
BDBM50329763
Synonyms:
4-[N-(6-Chloro-5-formyl-2-methylthiopyrimidin-4-yl)amino]benzenesulfonamide CHEMBL1233721
Type:
Small organic molecule
Emp. Form.:
C12H11ClN4O3S2
Mol. Mass.:
358.824
SMILES:
CSc1nc(Cl)c(C=O)c(Nc2ccc(cc2)S(N)(=O)=O)n1
: