Target
Carbonic anhydrase 1
Ligand
BDBM50329764
Substrate
Meas. Tech.
ChEMBL_674741 (CHEMBL1273994)
Kd
83±n/a nM
Citation
 Sudžius, JBaranauskiene, LGolovenko, DMatuliene, JMichailoviene, VTorresan, JJachno, JSukackaite, RManakova, EGražulis, STumkevičius, SMatulis, D 4-[N-(substituted 4-pyrimidinyl)amino]benzenesulfonamides as inhibitors of carbonic anhydrase isozymes I, II, VII, and XIII. Bioorg Med Chem 18:7413-21 (2010)  
Target
Name:
Carbonic anhydrase 1
Synonyms:
CA-I CAB Carbonate dehydratase I Carbonic anhydrase 1 (CA I) Carbonic anhydrase 1 (Recombinant CA I) Carbonic anhydrase B Carbonic anhydrase I (CA I) Carbonic anhydrase I (CAI) Carbonic anhydrase isoenzyme I (hCA I) | hCA
Type:
Enzyme
Mol. Mass.:
28873.37
Organism:
Homo sapiens (Human)
Description:
P00915
Residue:
261
  
Inhibitor
Name:
BDBM50329764
Synonyms:
4-({[6-chloro-5-formyl-2-(methylsulfanyl)pyrimidin-4-yl]amino}methyl)benzenesulfonamide CHEMBL1233735
Type:
Small organic molecule
Emp. Form.:
C13H13ClN4O3S2
Mol. Mass.:
372.85
SMILES:
CSc1nc(Cl)c(C=O)c(NCc2ccc(cc2)S(N)(=O)=O)n1
: