Target
Carbonic anhydrase 2
Ligand
BDBM50329759
Substrate
Meas. Tech.
ChEMBL_674742 (CHEMBL1273995)
Kd
90±n/a nM
Citation
 Sudžius, JBaranauskiene, LGolovenko, DMatuliene, JMichailoviene, VTorresan, JJachno, JSukackaite, RManakova, EGražulis, STumkevičius, SMatulis, D 4-[N-(substituted 4-pyrimidinyl)amino]benzenesulfonamides as inhibitors of carbonic anhydrase isozymes I, II, VII, and XIII. Bioorg Med Chem 18:7413-21 (2010)  
Target
Name:
Carbonic anhydrase 2
Synonyms:
CA-II CAC Carbonate dehydratase II Carbonic anhydrase 2 (CA-II) Carbonic anhydrase C Carbonic anhydrase II (CA-II) Carbonic anhydrase II (hCA II) | Carbonic anhydrase isoenzyme II (hCA II)
Type:
Enzyme
Mol. Mass.:
29250.71
Organism:
Homo sapiens (Human)
Description:
P00918
Residue:
260
  
Inhibitor
Name:
BDBM50329759
Synonyms:
4-[(6-chloro-5-nitropyrimidin-4-yl)amino]benzenesulfonamide CHEMBL1233722
Type:
Small organic molecule
Emp. Form.:
C10H8ClN5O4S
Mol. Mass.:
329.72
SMILES:
NS(=O)(=O)c1ccc(Nc2ncnc(Cl)c2[N+]([O-])=O)cc1
: