Target
Vesicular acetylcholine transporter
Ligand
BDBM50329776
Substrate
Meas. Tech.
ChEMBL_674755 (CHEMBL1274063)
Ki
10.9±n/a nM
Citation
 Kovac, MMavel, SDeuther-Conrad, WMéheux, NGlöckner, JWenzel, BAnderluh, MBrust, PGuilloteau, DEmond, P 3D QSAR study, synthesis, and in vitro evaluation of (+)-5-FBVM as potential PET radioligand for the vesicular acetylcholine transporter (VAChT). Bioorg Med Chem 18:7659-67 (2010)  
Target
Name:
Vesicular acetylcholine transporter
Synonyms:
Slc18a3 VACHT_RAT Vat | rVAT
Type:
PROTEIN
Mol. Mass.:
56533.41
Organism:
Rattus norvegicus
Description:
ChEMBL_1503353
Residue:
530
  
Inhibitor
Name:
BDBM50329776
Synonyms:
(rac)-5-Fluoro-3-(4-phenyl-piperidin-1-yl)-1,2,3,4-tetrahydro-naphthalen-2-ol | CHEMBL1271906
Type:
Small organic molecule
Emp. Form.:
C21H24FNO
Mol. Mass.:
325.4198
SMILES:
OC1Cc2cccc(F)c2CC1N1CCC(CC1)c1ccccc1
: