Target
Sigma non-opioid intracellular receptor 1
Ligand
BDBM50329776
Substrate
Meas. Tech.
ChEMBL_674756 (CHEMBL1274064)
Ki
13.2±n/a nM
Citation
 Kovac, MMavel, SDeuther-Conrad, WMéheux, NGlöckner, JWenzel, BAnderluh, MBrust, PGuilloteau, DEmond, P 3D QSAR study, synthesis, and in vitro evaluation of (+)-5-FBVM as potential PET radioligand for the vesicular acetylcholine transporter (VAChT). Bioorg Med Chem 18:7659-67 (2010)  
Target
Name:
Sigma non-opioid intracellular receptor 1
Synonyms:
Opioid receptor SGMR1_RAT Sigma non-opioid intracellular receptor 1 Sigma-1 | Sigmar1
Type:
Enzyme Catalytic Domain
Mol. Mass.:
25266.54
Organism:
RAT
Description:
Q9R0C9
Residue:
223
  
Inhibitor
Name:
BDBM50329776
Synonyms:
(rac)-5-Fluoro-3-(4-phenyl-piperidin-1-yl)-1,2,3,4-tetrahydro-naphthalen-2-ol | CHEMBL1271906
Type:
Small organic molecule
Emp. Form.:
C21H24FNO
Mol. Mass.:
325.4198
SMILES:
OC1Cc2cccc(F)c2CC1N1CCC(CC1)c1ccccc1
: