Target
TGF-beta receptor type-1
Ligand
BDBM50279121
Substrate
Meas. Tech.
ChEMBL_674822 (CHEMBL1272395)
IC50
3462±n/a nM
Citation
 Roth, GJHeckel, ABrandl, TGrauert, MHoerer, SKley, JTSchnapp, GBaum, PMennerich, DSchnapp, APark, JE Design, synthesis, and evaluation of indolinones as inhibitors of the transforming growth factorß receptor I (TGFßRI). J Med Chem 53:7287-95 (2010)  
Target
Name:
TGF-beta receptor type-1
Synonyms:
ALK-5 Activin A receptor type II-like protein kinase of 53kD SKR4 TGF-beta receptor type I TGFBR1 TGFR1_HUMAN Transforming growth factor-beta receptor type I
Type:
enzyme
Mol. Mass.:
55968.24
Organism:
Homo sapiens (Human)
Description:
P36897
Residue:
503
  
Inhibitor
Name:
BDBM50279121
Synonyms:
(Z)-3-[Phenyl-(4-piperidin-1-ylmethyl-phenylamino)-methylene]-indolin-2-one | CHEMBL500435
Type:
Small organic molecule
Emp. Form.:
C27H27N3O
Mol. Mass.:
409.5228
SMILES:
O=C1Nc2ccccc2C1C(=Nc1ccc(CN2CCCCC2)cc1)c1ccccc1
: