Target
Uridine phosphorylase 1
Ligand
BDBM50330391
Substrate
Meas. Tech.
ChEMBL_684504 (CHEMBL1287513)
Ki
1.1±n/a nM
Citation
 Cui, HRuda, GFCarrero-Lérida, JRuiz-Pérez, LMGilbert, IHGonzález-Pacanowska, D Exploring new inhibitors of Plasmodium falciparum purine nucleoside phosphorylase. Eur J Med Chem 45:5140-9 (2010)  
Target
Name:
Uridine phosphorylase 1
Synonyms:
UP UPP1_HUMAN UrdPase 1 | Uridine phosphorylase (UPase)
Type:
Enzyme
Mol. Mass.:
33939.54
Organism:
Homo sapiens (Human)
Description:
Q16831
Residue:
310
  
Inhibitor
Name:
BDBM50330391
Synonyms:
5-(3-(benzyloxy)benzyl)-1-((2-hydroxyethoxy)methyl)pyrimidine-2,4,6(1H,3H,5H)-trione | CHEMBL1277898
Type:
Small organic molecule
Emp. Form.:
C21H22N2O6
Mol. Mass.:
398.4092
SMILES:
OCCOCn1c(O)c(Cc2cccc(OCc3ccccc3)c2)c(=O)[nH]c1=O
: