Target
Sodium-dependent dopamine transporter
Ligand
BDBM50330972
Substrate
Meas. Tech.
ChEMBL_684105 (CHEMBL1286482)
EC50
2213±n/a nM
Citation
 Zhang, JLiu, XLei, XWang, LGuo, LZhao, GLin, G Discovery and synthesis of novel luteolin derivatives as DAT agonists. Bioorg Med Chem 18:7842-8 (2010)  
Target
Name:
Sodium-dependent dopamine transporter
Synonyms:
DA transporter SC6A3_RAT Sodium-dependent dopamine transporter | Sodium-dependent dopamine transporter (DAT)
Type:
Multi-pass membrane protein
Mol. Mass.:
68749.45
Organism:
Rattus norvegicus (rat)
Description:
P23977
Residue:
619
  
Inhibitor
Name:
BDBM50330972
Synonyms:
2-(3,4-Dihydroxyphenyl)-5-ethoxy-7-hydroxyl-4H-chromen-4-one | CHEMBL1277702
Type:
Small organic molecule
Emp. Form.:
C17H14O6
Mol. Mass.:
314.2895
SMILES:
CCOc1cc(O)cc2oc(cc(=O)c12)-c1ccc(O)c(O)c1
: