Target
Potassium voltage-gated channel subfamily H member 2
Ligand
BDBM50331384
Substrate
Meas. Tech.
ChEMBL_687158 (CHEMBL1291783)
IC50
4000±n/a nM
Citation
 Thewlis, KMAldegheri, LHarries, MHMookherjee, COliosi, BWard, SE N-substituted pyrrolidines and tetrahydrofurans as novel AMPAR positive modulators. Bioorg Med Chem Lett 20:7116-9 (2010)  
Target
Name:
Potassium voltage-gated channel subfamily H member 2
Synonyms:
1,3-beta-glucan synthase component GLS2 ERG Eag-related protein 1 Ether-a-go-go-related gene (HERG) Ether-a-go-go-related gene potassium channel 1 Ether-a-go-go-related gene potassium channel 1 (hERG1) Ether-a-go-go-related protein 1 H-ERG KCNH2 Potassium voltage-gated channel subfamily H member 2 (hERG) Voltage-gated potassium channel subunit Kv11.1 hERG Potassium Channel 1 | putative potassium channel subunit
Type:
Multi-pass membrane protein
Mol. Mass.:
126672.65
Organism:
Homo sapiens (Human)
Description:
Q12809
Residue:
1159
  
Inhibitor
Name:
BDBM50331384
Synonyms:
CHEMBL1289180 | N-((3R,4R)-1-methyl-4-(4-(thiophen-3-yl)phenyl)pyrrolidin-3-yl)propane-2-sulfonamide
Type:
Small organic molecule
Emp. Form.:
C18H24N2O2S2
Mol. Mass.:
364.525
SMILES:
CC(C)S(=O)(=O)N[C@H]1CN(C)C[C@@H]1c1ccc(cc1)-c1ccsc1
: