Target
Sodium-dependent serotonin transporter
Ligand
BDBM50331525
Substrate
Meas. Tech.
ChEMBL_687284 (CHEMBL1291960)
Ki
13.2±n/a nM
Citation
 Gu, XIzenwasser, SWade, DHousman, AGulasey, GRhoden, JBSavoie, CDMobley, DLLomenzo, SATrudell, ML Synthesis and structure-activity studies of benzyl ester meperidine and normeperidine derivatives as selective serotonin transporter ligands. Bioorg Med Chem 18:8356-64 (2010)  
Target
Name:
Sodium-dependent serotonin transporter
Synonyms:
5-HT Transporter 5HT transporter Anandamid membrane transporter, AMT Monoamine transporters; Norepinephrine & serotonin Slc6a4 Sodium-dependent serotonin transporter (SERT) | imipramine receptor
Type:
Multi-pass membrane protein
Mol. Mass.:
70168.43
Organism:
Rattus norvegicus (rat)
Description:
P31652
Residue:
630
  
Inhibitor
Name:
BDBM50331525
Synonyms:
4-Iodobenzyl 4-(3,4-dichlorophenyl)-1-methylpiperidine-4-carboxylate hydrochloride | CHEMBL1289303
Type:
Small organic molecule
Emp. Form.:
C20H20Cl2INO2
Mol. Mass.:
504.189
SMILES:
CN1CCC(CC1)(C(=O)OCc1ccc(I)cc1)c1ccc(Cl)c(Cl)c1
: