Target
Sodium-dependent serotonin transporter
Ligand
BDBM50331535
Substrate
Meas. Tech.
ChEMBL_687284 (CHEMBL1291960)
Ki
5.9±n/a nM
Citation
 Gu, XIzenwasser, SWade, DHousman, AGulasey, GRhoden, JBSavoie, CDMobley, DLLomenzo, SATrudell, ML Synthesis and structure-activity studies of benzyl ester meperidine and normeperidine derivatives as selective serotonin transporter ligands. Bioorg Med Chem 18:8356-64 (2010)  
Target
Name:
Sodium-dependent serotonin transporter
Synonyms:
5-HT Transporter 5HT transporter Anandamid membrane transporter, AMT Monoamine transporters; Norepinephrine & serotonin Slc6a4 Sodium-dependent serotonin transporter (SERT) | imipramine receptor
Type:
Multi-pass membrane protein
Mol. Mass.:
70168.43
Organism:
Rattus norvegicus (rat)
Description:
P31652
Residue:
630
  
Inhibitor
Name:
BDBM50331535
Synonyms:
4-Nitrobenzyl 4-(4-iodophenyl)piperidine-4-carboxylate oxalate | CHEMBL1289855
Type:
Small organic molecule
Emp. Form.:
C19H19IN2O4
Mol. Mass.:
466.2696
SMILES:
[O-][N+](=O)c1ccc(COC(=O)C2(CCNCC2)c2ccc(I)cc2)cc1
: