Target
Platelet-derived growth factor receptor beta
Ligand
BDBM50331612
Substrate
Meas. Tech.
ChEMBL_687457 (CHEMBL1292133)
Ki
>1000000±n/a nM
Citation
 Krug, MErlenkamp, GSippl, WSchächtele, CTotzke, FHilgeroth, A Discovery and selectivity-profiling of 4-benzylamino 1-aza-9-oxafluorene derivatives as lead structures for IGF-1R inhibitors. Bioorg Med Chem Lett 20:6915-9 (2010)  
Target
Name:
Platelet-derived growth factor receptor beta
Synonyms:
Beta-type platelet-derived growth factor receptor CD140b antigen PDGF Receptor Substrate PDGFR PDGFR-1 PDGFRB PGFRB_HUMAN Platelet-derived growth factor receptor 1 Platelet-derived growth factor receptor beta (PDGFR-beta) Platelet-derived growth factor receptor beta (PDGFRbeta) | VHL/PDGFRB
Type:
Enzyme
Mol. Mass.:
123922.25
Organism:
Homo sapiens (Human)
Description:
P09619
Residue:
1106
  
Inhibitor
Name:
BDBM50331612
Synonyms:
CHEMBL1290072 | N-(4-methoxybenzyl)benzofuro[2,3-b]pyridin-4-amine
Type:
Small organic molecule
Emp. Form.:
C19H16N2O2
Mol. Mass.:
304.3425
SMILES:
COc1ccc(CNc2ccnc3oc4ccccc4c23)cc1
: