Target
Thromboxane A2 receptor
Ligand
BDBM50331741
Substrate
Meas. Tech.
ChEMBL_686544 (CHEMBL1292331)
Ki
1481±n/a nM
Citation
 Li, LBeaulieu, CCarriere, MCDenis, DGreig, GGuay, DO'Neill, GZamboni, RWang, Z Potent and highly selective DP1 antagonists with 2,3,4,9-tetrahydro-1H-carbazole as pharmacophore. Bioorg Med Chem Lett 20:7462-5 (2010)  
Target
Name:
Thromboxane A2 receptor
Synonyms:
Prostanoid TP receptor TBXA2R Thromboxane Thromboxane Beta
Type:
Enyzme
Mol. Mass.:
37445.28
Organism:
Homo sapiens (Human)
Description:
P21731
Residue:
343
  
Inhibitor
Name:
BDBM50331741
Synonyms:
2-((R)-6-fluoro-8-(methylsulfonyl)-9-((S)-1-(4-(methylsulfonyl)phenyl)ethyl)-2,3,4,9-tetrahydro-1H-carbazol-1-yl)acetic acid | CHEMBL1290638
Type:
Small organic molecule
Emp. Form.:
C24H26FNO6S2
Mol. Mass.:
507.595
SMILES:
C[C@@H](c1ccc(cc1)S(C)(=O)=O)n1c2[C@@H](CC(O)=O)CCCc2c2cc(F)cc(c12)S(C)(=O)=O
: