Target
Procathepsin L
Ligand
BDBM50331775
Substrate
Meas. Tech.
ChEMBL_686699 (CHEMBL1290879)
IC50
5246±n/a nM
Citation
 Beaulieu, CIsabel, EFortier, AMassé, FMellon, CMéthot, NNdao, MNicoll-Griffith, DLee, DPark, HBlack, WC Identification of potent and reversible cruzipain inhibitors for the treatment of Chagas disease. Bioorg Med Chem Lett 20:7444-9 (2010)  
Target
Name:
Procathepsin L
Synonyms:
CATL1_HUMAN CTSL CTSL1 Cathepsin L Cathepsin L1 heavy chain MEP cathepsin L preproprotein
Type:
Enzyme
Mol. Mass.:
37557.19
Organism:
Homo sapiens (Human)
Description:
Purchased from Calbiochem (San Diego, CA).
Residue:
333
  
Inhibitor
Name:
BDBM50331775
Synonyms:
(S)-N-((S)-1-cyano-2-phenylethyl)-3-cyclopropyl-2-((S)-2,2,2-trifluoro-1-(4'-(methylsulfonyl)biphenyl-4-yl)ethylamino)propanamide | CHEMBL1289988
Type:
Small organic molecule
Emp. Form.:
C30H30F3N3O3S
Mol. Mass.:
569.638
SMILES:
CS(=O)(=O)c1ccc(cc1)-c1ccc(cc1)[C@H](N[C@@H](CC1CC1)C(=O)N[C@@H](Cc1ccccc1)C#N)C(F)(F)F
: