Target
Ribonuclease pancreatic
Ligand
BDBM50331792
Substrate
Meas. Tech.
ChEMBL_686759 (CHEMBL1290998)
Ki
193000±n/a nM
Citation
 Debnath, JDasgupta, SPathak, T Comparative inhibitory activity of 3'- and 5'-functionalized nucleosides on ribonuclease A. Bioorg Med Chem 18:8257-63 (2010)  
Target
Name:
Ribonuclease pancreatic
Synonyms:
CAM-RNase A RNASE1 RNS1
Type:
Enzyme
Mol. Mass.:
16468.79
Organism:
Bison bison (American bison)
Description:
carboxamidomethylated RNase A
Residue:
150
  
Inhibitor
Name:
BDBM50331792
Synonyms:
5'-Carboxy thymidine | CHEMBL1288589
Type:
Small organic molecule
Emp. Form.:
C10H12N2O6
Mol. Mass.:
256.2121
SMILES:
Cc1cn([C@H]2C[C@H](O)[C@H](O2)C(O)=O)c(=O)[nH]c1=O
: