Target
Adenosine receptor A2b
Ligand
BDBM50331919
Substrate
Meas. Tech.
ChEMBL_687325 (CHEMBL1292001)
Ki
81±n/a nM
Citation
 McGuinness, BFHo, KKStauffer, TMRokosz, LLMannava, NKultgen, SGSaionz, KKlon, AChen, WDesai, HRogers, WLWebb, MYin, JJiang, YLi, TYan, HJing, KZhang, SMajumdar, KKSrivastava, VSaha, S Discovery of novel quinolinone adenosine A2B antagonists. Bioorg Med Chem Lett 20:7414-20 (2010)  
Target
Name:
Adenosine receptor A2b
Synonyms:
AA2BR_HUMAN ADORA2B Adenosine receptors A2b | Adenosine receptors; A2a & A2b
Type:
G Protein-Coupled Receptor (GPCR)
Mol. Mass.:
36341.22
Organism:
Homo sapiens (Human)
Description:
Residue:
332
  
Inhibitor
Name:
BDBM50331919
Synonyms:
2-(2-oxo-4-(phenoxymethyl)-3-(thiazol-2-yl)-1,2-dihydroquinolin-6-yloxy)-N-(2-phenylpropan-2-yl)acetamide | CHEMBL1290325
Type:
Small organic molecule
Emp. Form.:
C30H27N3O4S
Mol. Mass.:
525.618
SMILES:
CC(C)(NC(=O)COc1ccc2[nH]c(=O)c(-c3nccs3)c(COc3ccccc3)c2c1)c1ccccc1
: