Target
Adenosine receptor A2a
Ligand
BDBM50331909
Substrate
Meas. Tech.
ChEMBL_687323 (CHEMBL1291999)
Ki
>10000±n/a nM
Citation
 McGuinness, BFHo, KKStauffer, TMRokosz, LLMannava, NKultgen, SGSaionz, KKlon, AChen, WDesai, HRogers, WLWebb, MYin, JJiang, YLi, TYan, HJing, KZhang, SMajumdar, KKSrivastava, VSaha, S Discovery of novel quinolinone adenosine A2B antagonists. Bioorg Med Chem Lett 20:7414-20 (2010)  
Target
Name:
Adenosine receptor A2a
Synonyms:
A2A adenosine receptor (hA2A) ADENOSINE A2 ADORA2 Adenosine A2A receptor (A2AAR)
Type:
G Protein-Coupled Receptor (GPCR)
Mol. Mass.:
44716.46
Organism:
Homo sapiens (Human)
Description:
P29274
Residue:
412
  
Inhibitor
Name:
BDBM50331909
Synonyms:
CHEMBL1290435 | N-((2-oxo-4-phenethyl-3-(thiazol-2-yl)-1,2-dihydroquinolin-6-yl)methyl)-3-phenylpropanamide
Type:
Small organic molecule
Emp. Form.:
C30H27N3O2S
Mol. Mass.:
493.619
SMILES:
O=C(CCc1ccccc1)NCc1ccc2[nH]c(=O)c(-c3nccs3)c(CCc3ccccc3)c2c1
: