Target
Disintegrin and metalloproteinase domain-containing protein 17
Ligand
BDBM50332272
Substrate
Meas. Tech.
ChEMBL_686062 (CHEMBL1292818)
Ki
0.560000±n/a nM
Citation
 Girijavallabhan, VMChen, LDai, CFeltz, RJFirmansjah, LLi, DKim, SHKozlowski, JALavey, BJKosinski, APiwinski, JJPopovici-Muller, JRizvi, RRosner, KEShankar, BBShih, NYSiddiqui, MATong, LWong, MKYang, DYYang, LYu, WZhou, GGuo, ZOrth, PMadison, VBian, HLundell, DNiu, XShah, HSun, JUmland, S Novel TNF-a converting enzyme (TACE) inhibitors as potential treatment for inflammatory diseases. Bioorg Med Chem Lett 20:7283-7 (2010)  
Target
Name:
Disintegrin and metalloproteinase domain-containing protein 17
Synonyms:
ADA17_HUMAN CSVP Disintegrin and metalloproteinase domain-containing protein 17 (ADAM17) TNF-alpha convertase TNF-alpha-converting enzyme (TACE) Tumor necrosis factor-α converting enzyme (TACE)
Type:
Enzyme
Mol. Mass.:
93007.89
Organism:
Homo sapiens (Human)
Description:
Residue:
824
  
Inhibitor
Name:
BDBM50332272
Synonyms:
(R)-4-((4-((6-methoxy-1-oxoisoindolin-2-yl)methyl)-2,5-dioxoimidazolidin-4-yl)ethynyl)benzamide | CHEMBL1288152
Type:
Small organic molecule
Emp. Form.:
C22H18N4O5
Mol. Mass.:
418.4021
SMILES:
COc1ccc2CN(C[C@]3(NC(=O)NC3=O)C#Cc3ccc(cc3)C(N)=O)C(=O)c2c1
: