Target
Disintegrin and metalloproteinase domain-containing protein 17
Ligand
BDBM50332280
Substrate
Meas. Tech.
ChEMBL_686062 (CHEMBL1292818)
Ki
0.520000±n/a nM
Citation
 Girijavallabhan, VMChen, LDai, CFeltz, RJFirmansjah, LLi, DKim, SHKozlowski, JALavey, BJKosinski, APiwinski, JJPopovici-Muller, JRizvi, RRosner, KEShankar, BBShih, NYSiddiqui, MATong, LWong, MKYang, DYYang, LYu, WZhou, GGuo, ZOrth, PMadison, VBian, HLundell, DNiu, XShah, HSun, JUmland, S Novel TNF-a converting enzyme (TACE) inhibitors as potential treatment for inflammatory diseases. Bioorg Med Chem Lett 20:7283-7 (2010)  
Target
Name:
Disintegrin and metalloproteinase domain-containing protein 17
Synonyms:
ADA17_HUMAN CSVP Disintegrin and metalloproteinase domain-containing protein 17 (ADAM17) TNF-alpha convertase TNF-alpha-converting enzyme (TACE) Tumor necrosis factor-α converting enzyme (TACE)
Type:
Enzyme
Mol. Mass.:
93007.89
Organism:
Homo sapiens (Human)
Description:
Residue:
824
  
Inhibitor
Name:
BDBM50332280
Synonyms:
(R)-5-((6-methoxy-1-oxoisoindolin-2-yl)methyl)-5-((1-methyl-1H-indazol-6-yl)ethynyl)imidazolidine-2,4-dione | CHEMBL1288268
Type:
Small organic molecule
Emp. Form.:
C23H19N5O4
Mol. Mass.:
429.4281
SMILES:
COc1ccc2CN(C[C@]3(NC(=O)NC3=O)C#Cc3ccc4cnn(C)c4c3)C(=O)c2c1
: