Target
Interstitial collagenase
Ligand
BDBM50332283
Substrate
Meas. Tech.
ChEMBL_686064 (CHEMBL1292820)
IC50
5200±n/a nM
Citation
 Girijavallabhan, VMChen, LDai, CFeltz, RJFirmansjah, LLi, DKim, SHKozlowski, JALavey, BJKosinski, APiwinski, JJPopovici-Muller, JRizvi, RRosner, KEShankar, BBShih, NYSiddiqui, MATong, LWong, MKYang, DYYang, LYu, WZhou, GGuo, ZOrth, PMadison, VBian, HLundell, DNiu, XShah, HSun, JUmland, S Novel TNF-a converting enzyme (TACE) inhibitors as potential treatment for inflammatory diseases. Bioorg Med Chem Lett 20:7283-7 (2010)  
Target
Name:
Interstitial collagenase
Synonyms:
CLG MMP1 Matrix metalloproteinase-1 | Matrix metalloproteinase-1 (MMP-1)
Type:
Enzyme
Mol. Mass.:
54010.26
Organism:
Homo sapiens (Human)
Description:
P03956
Residue:
469
  
Inhibitor
Name:
BDBM50332283
Synonyms:
(R)-5-((6-methoxy-1-oxoisoindolin-2-yl)methyl)-5-(pyridin-3-ylethynyl)imidazolidine-2,4-dione | CHEMBL1287851
Type:
Small organic molecule
Emp. Form.:
C20H16N4O4
Mol. Mass.:
376.3654
SMILES:
COc1ccc2CN(C[C@]3(NC(=O)NC3=O)C#Cc3cccnc3)C(=O)c2c1
: