Target
Interstitial collagenase
Ligand
BDBM50332949
Substrate
Meas. Tech.
ChEMBL_694544 (CHEMBL1635953)
Ki
143±n/a nM
Citation
 Attolino, ECalderone, VDragoni, EFragai, MRichichi, BLuchinat, CNativi, C Structure-based approach to nanomolar, water soluble matrix metalloproteinases inhibitors (MMPIs). Eur J Med Chem 45:5919-25 (2010)  
Target
Name:
Interstitial collagenase
Synonyms:
CLG MMP1 Matrix metalloproteinase-1 | Matrix metalloproteinase-1 (MMP-1)
Type:
Enzyme
Mol. Mass.:
54010.26
Organism:
Homo sapiens (Human)
Description:
P03956
Residue:
469
  
Inhibitor
Name:
BDBM50332949
Synonyms:
(R)-N,3-dihydroxy-2-(4-methoxyphenylsulfonamido)propanamide | CHEMBL1632639
Type:
Small organic molecule
Emp. Form.:
C10H14N2O6S
Mol. Mass.:
290.293
SMILES:
COc1ccc(cc1)S(=O)(=O)N[C@H](CO)C(=O)NO
: