Target
Matrilysin
Ligand
BDBM13080
Substrate
Meas. Tech.
ChEMBL_694545 (CHEMBL1635954)
Ki
13000±n/a nM
Citation
 Attolino, ECalderone, VDragoni, EFragai, MRichichi, BLuchinat, CNativi, C Structure-based approach to nanomolar, water soluble matrix metalloproteinases inhibitors (MMPIs). Eur J Med Chem 45:5919-25 (2010)  
Target
Name:
Matrilysin
Synonyms:
MMP7 MPSL1 Matrix metalloproteinase-7 (MMP-7) PUMP1
Type:
Enzyme
Mol. Mass.:
29681.54
Organism:
Homo sapiens (Human)
Description:
P09237
Residue:
267
  
Inhibitor
Name:
BDBM13080
Synonyms:
CGS 27023A Analog 3 US20230357139, Compound A | US20240050571, Compound NNGH
Type:
Small organic molecule
Emp. Form.:
C13H20N2O5S
Mol. Mass.:
316.373
SMILES:
COc1ccc(cc1)S(=O)(=O)N(CC(C)C)CC(=O)NO
: