Target
Collagenase 3
Ligand
BDBM50332949
Substrate
Meas. Tech.
ChEMBL_694548 (CHEMBL1635957)
Ki
2.2±n/a nM
Citation
 Attolino, ECalderone, VDragoni, EFragai, MRichichi, BLuchinat, CNativi, C Structure-based approach to nanomolar, water soluble matrix metalloproteinases inhibitors (MMPIs). Eur J Med Chem 45:5919-25 (2010)  
Target
Name:
Collagenase 3
Synonyms:
MMP-13 MMP13_HUMAN Matrix metalloproteinase-13 (MMP-13) | Matrix metalloproteinase-13 (MMP13)
Type:
Enzyme
Mol. Mass.:
53808.06
Organism:
Homo sapiens (Human)
Description:
P45452
Residue:
471
  
Inhibitor
Name:
BDBM50332949
Synonyms:
(R)-N,3-dihydroxy-2-(4-methoxyphenylsulfonamido)propanamide | CHEMBL1632639
Type:
Small organic molecule
Emp. Form.:
C10H14N2O6S
Mol. Mass.:
290.293
SMILES:
COc1ccc(cc1)S(=O)(=O)N[C@H](CO)C(=O)NO
: