Target
Metabotropic glutamate receptor 2
Ligand
BDBM50332976
Substrate
Meas. Tech.
ChEMBL_696216 (CHEMBL1639369)
IC50
5±n/a nM
Citation
 Woltering, TJWichmann, JGoetschi, EKnoflach, FBallard, TMHuwyler, JGatti, S Synthesis and characterization of 1,3-dihydro-benzo[b][1,4]diazepin-2-one derivatives: Part 4. In vivo active potent and selective non-competitive metabotropic glutamate receptor 2/3 antagonists. Bioorg Med Chem Lett 20:6969-74 (2010)  
Target
Name:
Metabotropic glutamate receptor 2
Synonyms:
GPRC1B GRM2_HUMAN Metabotropic glutamate receptor mGlu2 | metabotropic glutamate 2
Type:
Enzyme
Mol. Mass.:
95584.88
Organism:
Homo sapiens (Human)
Description:
Q14416
Residue:
872
  
Inhibitor
Name:
BDBM50332976
Synonyms:
4-(3-(2-benzylpyridin-4-yl)phenyl)-7-methyl-8-(trifluoromethyl)-1H-benzo[b][1,4]diazepin-2(3H)-one | CHEMBL1631867
Type:
Small organic molecule
Emp. Form.:
C29H22F3N3O
Mol. Mass.:
485.4997
SMILES:
Cc1cc2N=C(CC(=O)Nc2cc1C(F)(F)F)c1cccc(c1)-c1ccnc(Cc2ccccc2)c1
: