Target
Carbonic anhydrase 1
Ligand
BDBM50333131
Substrate
Meas. Tech.
ChEMBL_701309 (CHEMBL1648929)
Ki
540000±n/a nM
Citation
 Burghout, PVullo, DScozzafava, AHermans, PWSupuran, CT Inhibition of theß-carbonic anhydrase from Streptococcus pneumoniae by inorganic anions and small molecules: Toward innovative drug design of antiinfectives? Bioorg Med Chem 19:243-8 (2011)  
Target
Name:
Carbonic anhydrase 1
Synonyms:
CA-I CAB Carbonate dehydratase I Carbonic anhydrase 1 (CA I) Carbonic anhydrase 1 (Recombinant CA I) Carbonic anhydrase B Carbonic anhydrase I (CA I) Carbonic anhydrase I (CAI) Carbonic anhydrase isoenzyme I (hCA I) | hCA
Type:
Enzyme
Mol. Mass.:
28873.37
Organism:
Homo sapiens (Human)
Description:
P00915
Residue:
261
  
Inhibitor
Name:
BDBM50333131
Synonyms:
CHEMBL1075630 tetrasodium {[dioxido(oxo)vanadio]oxy}(oxo)vanadiumbis(olate)
Type:
Small organic molecule
Emp. Form.:
O7V2
Mol. Mass.:
213.881
SMILES:
[O-][V]([O-])(=O)O[V]([O-])([O-])=O
: