Target
Amine oxidase [flavin-containing] A
Ligand
BDBM29136
Substrate
Meas. Tech.
ChEMBL_700193 (CHEMBL1647186)
IC50
6560±n/a nM
Citation
 Gaspar, AReis, JFonseca, AMilhazes, NViña, DUriarte, EBorges, F Chromone 3-phenylcarboxamides as potent and selective MAO-B inhibitors. Bioorg Med Chem Lett 21:707-9 (2011)  
Target
Name:
Amine oxidase [flavin-containing] A
Synonyms:
AOFA_HUMAN MAO-A Monoamine oxidase Monoamine oxidase type A (MAO A) Monoamine oxidase type A (MAOA)
Type:
Protein
Mol. Mass.:
59689.53
Organism:
Homo sapiens (Human)
Description:
P21397
Residue:
527
  
Inhibitor
Name:
BDBM29136
Synonyms:
CHEMBL92401 Iprazid | Iproniazid
Type:
Small organic molecule
Emp. Form.:
C9H13N3O
Mol. Mass.:
179.219
SMILES:
CC(C)NNC(=O)c1ccncc1
: