Target
Amine oxidase [flavin-containing] B
Ligand
BDBM50333651
Substrate
Meas. Tech.
ChEMBL_700194 (CHEMBL1647187)
IC50
400±n/a nM
Citation
 Gaspar, AReis, JFonseca, AMilhazes, NViña, DUriarte, EBorges, F Chromone 3-phenylcarboxamides as potent and selective MAO-B inhibitors. Bioorg Med Chem Lett 21:707-9 (2011)  
Target
Name:
Amine oxidase [flavin-containing] B
Synonyms:
AOFB_HUMAN MAOB Monoamine oxidase type B (MAO B) Monoamine oxidase type B (MAOB)
Type:
Protein
Mol. Mass.:
58768.76
Organism:
Homo sapiens (Human)
Description:
P27338
Residue:
520
  
Inhibitor
Name:
BDBM50333651
Synonyms:
4-oxo-N-phenyl-4H-chromene-3-carboxamide | CHEMBL1643120
Type:
Small organic molecule
Emp. Form.:
C16H11NO3
Mol. Mass.:
265.2634
SMILES:
O=C(Nc1ccccc1)c1coc2ccccc2c1=O
: