Target
Amine oxidase [flavin-containing] B
Ligand
BDBM50333654
Substrate
Meas. Tech.
ChEMBL_700194 (CHEMBL1647187)
IC50
120±n/a nM
Citation
 Gaspar, AReis, JFonseca, AMilhazes, NViña, DUriarte, EBorges, F Chromone 3-phenylcarboxamides as potent and selective MAO-B inhibitors. Bioorg Med Chem Lett 21:707-9 (2011)  
Target
Name:
Amine oxidase [flavin-containing] B
Synonyms:
AOFB_HUMAN MAOB Monoamine oxidase type B (MAO B) Monoamine oxidase type B (MAOB)
Type:
Protein
Mol. Mass.:
58768.76
Organism:
Homo sapiens (Human)
Description:
P27338
Residue:
520
  
Inhibitor
Name:
BDBM50333654
Synonyms:
CHEMBL1643123 | N-(4-(methylthio)phenyl)-4-oxo-4H-chromene-3-carboxamide
Type:
Small organic molecule
Emp. Form.:
C17H13NO3S
Mol. Mass.:
311.355
SMILES:
CSc1ccc(NC(=O)c2coc3ccccc3c2=O)cc1
: