Target
Amine oxidase [flavin-containing] B
Ligand
BDBM50131081
Substrate
Meas. Tech.
ChEMBL_700194 (CHEMBL1647187)
IC50
0.048±n/a nM
Citation
 Gaspar, AReis, JFonseca, AMilhazes, NViña, DUriarte, EBorges, F Chromone 3-phenylcarboxamides as potent and selective MAO-B inhibitors. Bioorg Med Chem Lett 21:707-9 (2011)  
Target
Name:
Amine oxidase [flavin-containing] B
Synonyms:
AOFB_HUMAN MAOB Monoamine oxidase type B (MAO B) Monoamine oxidase type B (MAOB)
Type:
Protein
Mol. Mass.:
58768.76
Organism:
Homo sapiens (Human)
Description:
P27338
Residue:
520
  
Inhibitor
Name:
BDBM50131081
Synonyms:
4-oxo-4H-chromene-3-carboxylic acid | CHEMBL315361
Type:
Small organic molecule
Emp. Form.:
C10H6O4
Mol. Mass.:
190.1522
SMILES:
OC(=O)c1coc2ccccc2c1=O
: